BDBM50337754 (Z)-5-(((1R)-7,7-Dimethyl-2-oxobicyclo[2.2.1]heptan-1-yl)methylsulfonylimino)-4-methyl-4,5-dihydro-1,3,4-thiadiazole-2-sulfonamide::CHEMBL1683474
SMILES Cn1nc(sc1=NS(=O)(=O)C[C@@]12CCC(CC1=O)C2(C)C)S(N)(=O)=O
InChI Key InChIKey=VUWSFOHOCYLFCT-RLROJCQXSA-N
Data  4 KI
  Tab Delimited (TSV)   2D SDfile   Computed 3D by Vconf -m prep SDfile
Find this compound or compounds like it in BindingDB:
Activity Spreadsheet -- Enzyme Inhibition Constant Data from BindingDB
Found 4 hits for monomerid = 50337754
TargetCarbonic anhydrase 5A, mitochondrial(Homo sapiens (Human))
Universit£
Curated by ChEMBL
LigandPNGBDBM50337754((Z)-5-(((1R)-7,7-Dimethyl-2-oxobicyclo[2.2.1]hepta...)
Affinity DataKi:  5.90nM. Assay description: Inhibition of human recombinant CA5A mitochondrial isoform by stopped-flow CO2 hydration assay
In DepthDetails ArticlePubMed
TargetCarbonic anhydrase 5B, mitochondrial(Homo sapiens (Human))
Universit£
Curated by ChEMBL
LigandPNGBDBM50337754((Z)-5-(((1R)-7,7-Dimethyl-2-oxobicyclo[2.2.1]hepta...)
Affinity DataKi:  7.80nM. Assay description: Inhibition of human recombinant CA5B mitochondrial isoform by stopped-flow CO2 hydration assay
In DepthDetails ArticlePubMed
TargetCarbonic anhydrase 2(Homo sapiens (Human))
Universit£
Curated by ChEMBL
LigandPNGBDBM50337754((Z)-5-(((1R)-7,7-Dimethyl-2-oxobicyclo[2.2.1]hepta...)
Affinity DataKi:  1.77E+3nM. Assay description: Inhibition of human recombinant CA2 cytosolic isoform by stopped-flow CO2 hydration assay
In DepthDetails ArticlePubMed
TargetCarbonic anhydrase 1(Homo sapiens (Human))
Universit£
Curated by ChEMBL
LigandPNGBDBM50337754((Z)-5-(((1R)-7,7-Dimethyl-2-oxobicyclo[2.2.1]hepta...)
Affinity DataKi:  5.25E+3nM. Assay description: Inhibition of human recombinant CA1 cytosolic isoform by stopped-flow CO2 hydration assay
In DepthDetails ArticlePubMed