BDBM50337803 3-(4-amino-2H-pyrazolo[3,4-d]pyrimidin-2-yl)nonan-2-ol::CHEMBL1181730
SMILES CCCCCCC(C(C)O)n1cc2c(N)ncnc2n1
InChI Key InChIKey=PSAZDCCGGKBZJY-UHFFFAOYSA-N
Data  2 KI
  Tab Delimited (TSV)   2D SDfile   Computed 3D by Vconf -m prep SDfile
Find this compound or compounds like it in BindingDB:
Activity Spreadsheet -- Enzyme Inhibition Constant Data from BindingDB
Found 2 hits for monomerid = 50337803
TargetVascular endothelial growth factor receptor 2(Homo sapiens (Human))
Chaminade University Of Honolulu
Curated by ChEMBL
LigandPNGBDBM50337803(3-(4-amino-2H-pyrazolo[3,4-d]pyrimidin-2-yl)nonan-...)
Affinity DataKi:  53nM. Assay description: Inhibition of human recombinant His-tagged VEGFR2 assessed as infrared absorptionChecked by Author
In DepthDetails ArticlePubMed
TargetAdenosine deaminase(Bos taurus (bovine))
Universit£
Curated by ChEMBL
LigandPNGBDBM50337803(3-(4-amino-2H-pyrazolo[3,4-d]pyrimidin-2-yl)nonan-...)
Affinity DataKi:  53.4nM. Assay description: Inhibitory constant against bovine spleen Adenosine deaminase
In DepthDetails ArticlePubMed