BDBM50338025 (S)-1-(2-(5,6-dichloro-1H-benzo[d]imidazol-2-yl)pyrrolidin-1-yl)-3-(4-(pyrimidin-2-yl)piperidin-1-yl)propan-1-one::CHEMBL1684293
SMILES Clc1cc2nc([nH]c2cc1Cl)[C@@H]1CCCN1C(=O)CCN1CCC(CC1)c1ncccn1
InChI Key InChIKey=PIWGCGFPNPIAMO-FQEVSTJZSA-N
Data  1 IC50
  Tab Delimited (TSV)   2D SDfile   Computed 3D by Vconf -m prep SDfile
Find this compound or compounds like it in BindingDB:
Activity Spreadsheet -- Enzyme Inhibition Constant Data from BindingDB
Found 1 hit for monomerid = 50338025
TargetLysosomal Pro-X carboxypeptidase(Homo sapiens (Human))
Merck Research Laboratories
Curated by ChEMBL
LigandPNGBDBM50338025((S)-1-(2-(5,6-dichloro-1H-benzo[d]imidazol-2-yl)py...)
Affinity DataIC50:  44nM. Assay description: Inhibition of human PrCP
In DepthDetails ArticlePubMed