BDBM50338117 2-(2-(1H-pyrazolo[4,3-b]pyridin-3-yl)-1H-indol-6-yl)-1-phenylethanone::CHEMBL1684662
SMILES O=C(Cc1ccc2cc([nH]c2c1)-c1n[nH]c2cccnc12)c1ccccc1
InChI Key InChIKey=CDVMXMZPDJHSCC-UHFFFAOYSA-N
Data  1 IC50
  Tab Delimited (TSV)   2D SDfile   Computed 3D by Vconf -m prep SDfile
Find this compound or compounds like it in BindingDB:
Activity Spreadsheet -- Enzyme Inhibition Constant Data from BindingDB
Found 1 hit for monomerid = 50338117
TargetTyrosine-protein kinase ITK/TSK(Homo sapiens (Human))
Nycomed
Curated by ChEMBL
LigandPNGBDBM50338117(2-(2-(1H-pyrazolo[4,3-b]pyridin-3-yl)-1H-indol-6-y...)
Affinity DataIC50:  60nM. Assay description: Inhibition of recombinant GST-tagged full-length ITK expressed in baculovirus expression system after 30 mins by scintillation proximity assay
In DepthDetails ArticlePubMed