BDBM50338166 (R)-2-(4-tert-butylphenyl)-N-(1-(5-methoxypyridin-2-yl)ethyl)acetamide::CHEMBL1684932
SMILES COc1ccc(nc1)[C@@H](C)NC(=O)Cc1ccc(cc1)C(C)(C)C
InChI Key InChIKey=XNJZKWRGHNXPBD-CQSZACIVSA-N
Data  1 KI  1 IC50
  Tab Delimited (TSV)   2D SDfile   Computed 3D by Vconf -m prep SDfile
Find this compound or compounds like it in BindingDB:
Activity Spreadsheet -- Enzyme Inhibition Constant Data from BindingDB
Found 2 hits for monomerid = 50338166
TargetVoltage-dependent T-type calcium channel subunit alpha-1I(Homo sapiens (Human))
Merck Research Laboratories
Curated by ChEMBL
LigandPNGBDBM50338166((R)-2-(4-tert-butylphenyl)-N-(1-(5-methoxypyridin-...)
Affinity DataKi:  5nM. Assay description: Antagonist activity at Cav3.3 alpha1i expressed in HEK293 cells at -100 mV by standard voltage-clamp electrophysiology assay
In DepthDetails ArticlePubMed
TargetPotassium voltage-gated channel subfamily H member 2(Homo sapiens (Human))
Merck Research Laboratories
Curated by ChEMBL
LigandPNGBDBM50338166((R)-2-(4-tert-butylphenyl)-N-(1-(5-methoxypyridin-...)
Affinity DataIC50: >1.00E+4nM. Assay description: Inhibition of human ERG
In DepthDetails ArticlePubMed