BDBM50338173 (2S)-3-(4-(dimethylcarbamoyloxy)phenyl)-2-(5-(2-methoxyphenyl)pyrimidin-4-ylamino)propanoic acid::CHEMBL1684960
SMILES COc1ccccc1-c1cncnc1N[C@@H](Cc1ccc(OC(=O)N(C)C)cc1)C(O)=O
InChI Key InChIKey=ZOMDPFRLBCLEDW-IBGZPJMESA-N
Data  1 IC50
  Tab Delimited (TSV)   2D SDfile   Computed 3D by Vconf -m prep SDfile
Find this compound or compounds like it in BindingDB:
Activity Spreadsheet -- Enzyme Inhibition Constant Data from BindingDB
Found 1 hit for monomerid = 50338173
TargetIntegrin alpha-4/beta-1(Homo sapiens (Human))
Elan Pharmaceuticals
Curated by ChEMBL
LigandPNGBDBM50338173((2S)-3-(4-(dimethylcarbamoyloxy)phenyl)-2-(5-(2-me...)
Affinity DataIC50:  16nM. Assay description: Inhibition of integrin alpha4beta1-mediated Jurkat cell adhesion to VCAM-1 by FACS analysis
In DepthDetails ArticlePubMed