BDBM50338449 CHEMBL1682983::trans-N-(4-((R)-1-amino-2-(2,5-difluorophenyl)ethyl)cyclohexyl)-2,4-difluoro-N-methylbenzenesulfonamide
SMILES CN([C@H]1CC[C@@H](CC1)[C@H](N)Cc1cc(F)ccc1F)S(=O)(=O)c1ccc(F)cc1F
InChI Key InChIKey=PHMVETVDLLQURM-YXKFXFPPSA-N
Data  5 IC50
  Tab Delimited (TSV)   2D SDfile   Computed 3D by Vconf -m prep SDfile
Find this compound or compounds like it in BindingDB:
Activity Spreadsheet -- Enzyme Inhibition Constant Data from BindingDB
Found 5 hits for monomerid = 50338449
TargetProlyl endopeptidase FAP(Homo sapiens (Human))
Merck Research Laboratories
Curated by ChEMBL
LigandPNGBDBM50338449(CHEMBL1682983 | trans-N-(4-((R)-1-amino-2-(2,5-dif...)
Affinity DataIC50: >3.50E+4nM. Assay description: Inhibition of FAP
In DepthDetails ArticlePubMed
TargetDipeptidyl peptidase 2(Homo sapiens (Human))
Merck Research Laboratories
Curated by ChEMBL
LigandPNGBDBM50338449(CHEMBL1682983 | trans-N-(4-((R)-1-amino-2-(2,5-dif...)
Affinity DataIC50:  1.70E+4nM. Assay description: Inhibition of QPP
In DepthDetails ArticlePubMed
TargetDipeptidyl peptidase 9(Homo sapiens (Human))
Merck Research Laboratories
Curated by ChEMBL
LigandPNGBDBM50338449(CHEMBL1682983 | trans-N-(4-((R)-1-amino-2-(2,5-dif...)
Affinity DataIC50:  3.20E+4nM. Assay description: Inhibition of DPP9
In DepthDetails ArticlePubMed
TargetDipeptidyl peptidase 4(Homo sapiens (Human))
Merck Research Laboratories
Curated by ChEMBL
LigandPNGBDBM50338449(CHEMBL1682983 | trans-N-(4-((R)-1-amino-2-(2,5-dif...)
Affinity DataIC50:  150nM. Assay description: Inhibition of DPP4
In DepthDetails ArticlePubMed
TargetDipeptidyl peptidase 8(Homo sapiens (Human))
Merck Research Laboratories
Curated by ChEMBL
LigandPNGBDBM50338449(CHEMBL1682983 | trans-N-(4-((R)-1-amino-2-(2,5-dif...)
Affinity DataIC50:  5.50E+4nM. Assay description: Inhibition of DPP8
In DepthDetails ArticlePubMed