BDBM50338466 CHEMBL1683100::trans-N-(4-((R)-1-amino-2-(2,5-difluorophenyl)ethyl)cyclohexyl)-N-methylisobutyramide
SMILES CC(C)C(=O)N(C)[C@H]1CC[C@@H](CC1)[C@H](N)Cc1cc(F)ccc1F
InChI Key InChIKey=UADBUNNUDNCSNG-MZMPZRCHSA-N
Data  5 IC50
  Tab Delimited (TSV)   2D SDfile   Computed 3D by Vconf -m prep SDfile
Find this compound or compounds like it in BindingDB:
Activity Spreadsheet -- Enzyme Inhibition Constant Data from BindingDB
Found 5 hits for monomerid = 50338466
TargetProlyl endopeptidase FAP(Homo sapiens (Human))
Merck Research Laboratories
Curated by ChEMBL
LigandPNGBDBM50338466(CHEMBL1683100 | trans-N-(4-((R)-1-amino-2-(2,5-dif...)
Affinity DataIC50: >3.50E+4nM. Assay description: Inhibition of FAP
In DepthDetails ArticlePubMed
TargetDipeptidyl peptidase 2(Homo sapiens (Human))
Merck Research Laboratories
Curated by ChEMBL
LigandPNGBDBM50338466(CHEMBL1683100 | trans-N-(4-((R)-1-amino-2-(2,5-dif...)
Affinity DataIC50: >1.00E+5nM. Assay description: Inhibition of QPP
In DepthDetails ArticlePubMed
TargetDipeptidyl peptidase 9(Homo sapiens (Human))
Merck Research Laboratories
Curated by ChEMBL
LigandPNGBDBM50338466(CHEMBL1683100 | trans-N-(4-((R)-1-amino-2-(2,5-dif...)
Affinity DataIC50:  5.30E+4nM. Assay description: Inhibition of DPP9
In DepthDetails ArticlePubMed
TargetDipeptidyl peptidase 4(Homo sapiens (Human))
Merck Research Laboratories
Curated by ChEMBL
LigandPNGBDBM50338466(CHEMBL1683100 | trans-N-(4-((R)-1-amino-2-(2,5-dif...)
Affinity DataIC50:  130nM. Assay description: Inhibition of DPP4
In DepthDetails ArticlePubMed
TargetDipeptidyl peptidase 8(Homo sapiens (Human))
Merck Research Laboratories
Curated by ChEMBL
LigandPNGBDBM50338466(CHEMBL1683100 | trans-N-(4-((R)-1-amino-2-(2,5-dif...)
Affinity DataIC50: >1.00E+5nM. Assay description: Inhibition of DPP8
In DepthDetails ArticlePubMed