BDBM50338506 1-((3S,4S)-4-amino-1-(6-(2,4,5-trifluorophenyl)pyrimidin-4-yl)pyrrolidin-3-yl)piperidin-2-one::CHEMBL1683559
SMILES N[C@H]1CN(C[C@@H]1N1CCCCC1=O)c1cc(ncn1)-c1cc(F)c(F)cc1F
InChI Key InChIKey=ZSJZHAJFTNGTOQ-RDJZCZTQSA-N
Data  1 IC50
  Tab Delimited (TSV)   2D SDfile   Computed 3D by Vconf -m prep SDfile
Find this compound or compounds like it in BindingDB:
Activity Spreadsheet -- Enzyme Inhibition Constant Data from BindingDB
Found 1 hit for monomerid = 50338506
TargetDipeptidyl peptidase 4(Homo sapiens (Human))
Pfizer
Curated by ChEMBL
LigandPNGBDBM50338506(1-((3S,4S)-4-amino-1-(6-(2,4,5-trifluorophenyl)pyr...)
Affinity DataIC50:  47nM. Assay description: Inhibition of human DPP4
In DepthDetails ArticlePubMed