BDBM50338846 1-(3-(Furan-2-yl)-4,5-dihydro-5-(3,4,5-trimethoxyphenyl)(pyrazol-1-yl)ethanone::CHEMBL1684774
SMILES COc1cc(cc(OC)c1OC)C1CC(=NN1C(C)=O)c1ccco1
InChI Key InChIKey=IAQIRHKCAFXUKZ-UHFFFAOYSA-N
Data  1 IC50
  Tab Delimited (TSV)   2D SDfile   Computed 3D by Vconf -m prep SDfile
Find this compound or compounds like it in BindingDB:
Activity Spreadsheet -- Enzyme Inhibition Constant Data from BindingDB
Found 1 hit for monomerid = 50338846
TargetXanthine dehydrogenase/oxidase(Bos taurus (Bovine))
Indo-Soviet Friendship College Of Pharmacy
Curated by ChEMBL
LigandPNGBDBM50338846(1-(3-(Furan-2-yl)-4,5-dihydro-5-(3,4,5-trimethoxyp...)
Affinity DataIC50:  2.87E+4nM. Assay description: Inhibition of bovine Xanthine oxidase assessed as decrease in uric acid production preincubated at 293 nM of compound for 5 mins by spectrophotometry
In DepthDetails ArticlePubMed