BDBM50338954 CHEMBL1685054::N-(5-tert-Butyl-1,3,4-thiadiazol-2-yl)-4-dodecylbenzenesulfonamide::US9320734, 116
SMILES CCCCCCCCCCCCc1ccc(cc1)S(=O)(=O)Nc1nnc(s1)C(C)(C)C
InChI Key InChIKey=URMLPGTYFKOPTD-UHFFFAOYSA-N
Data  1 KI  2 Kd
  Tab Delimited (TSV)   2D SDfile   Computed 3D by Vconf -m prep SDfile
Find this compound or compounds like it in BindingDB:
Activity Spreadsheet -- Enzyme Inhibition Constant Data from BindingDB
Found 3 hits for monomerid = 50338954
TargetRAC-alpha serine/threonine-protein kinase(Mus musculus)
The University Of Arizona
Curated by ChEMBL
LigandPNGBDBM50338954(CHEMBL1685054 | N-(5-tert-Butyl-1,3,4-thiadiazol-2...)
Affinity DataKi: >5.00E+4nM. Assay description: Displacement of biotinylated phosphatidylinositol-3,4,5-phosphate from mouse AKT1 PH domain by surface plasmon resonance competitive binding assay
In DepthDetails ArticlePubMed
TargetRAC-alpha serine/threonine-protein kinase [1-123](Homo sapiens (Human))
The University Of Texas System
US Patent
LigandPNGBDBM50338954(CHEMBL1685054 | N-(5-tert-Butyl-1,3,4-thiadiazol-2...)
Affinity DataKd:  4.07E+3nM. Assay description: SPR interaction analyses were performed with a Biacore 2000, using Biacore 2000 Control Software v3.2 and BIAevaluation v4.1 analysis software (Biaco...
In DepthDetails US Patent
TargetRAC-alpha serine/threonine-protein kinase [1-123](Homo sapiens (Human))
The University Of Texas System
US Patent
LigandPNGBDBM50338954(CHEMBL1685054 | N-(5-tert-Butyl-1,3,4-thiadiazol-2...)
Affinity DataKd:  5.87E+5nM. Assay description: SPR interaction analyses were performed with a Biacore 2000, using Biacore 2000 Control Software v3.2 and BIAevaluation v4.1 analysis software (Biaco...
In DepthDetails US Patent