BDBM50339271 (Z/E)-3-((3-(7-chloroquinolin-4-ylamino)propylamino)methylene)-1-methylindolin-2-one::CHEMBL1689615
SMILES CN1C(=O)C(C=NCCCNc2ccnc3cc(Cl)ccc23)c2ccccc12
InChI Key InChIKey=AEZWBKSJTWQURX-UHFFFAOYSA-N
Data  1 IC50
  Tab Delimited (TSV)   2D SDfile   Computed 3D by Vconf -m prep SDfile
Find this compound or compounds like it in BindingDB:
Activity Spreadsheet -- Enzyme Inhibition Constant Data from BindingDB
Found 1 hit for monomerid = 50339271
TargetFalcipain-2(Plasmodium falciparum)
University Of Lisbon
Curated by ChEMBL
LigandPNGBDBM50339271((Z/E)-3-((3-(7-chloroquinolin-4-ylamino)propylamin...)
Affinity DataIC50: >5.00E+4nM. Assay description: Inhibition of Plasmodium falciparum falcipain 2 incubated with compound for 10 mins before addition of 25 uM Z-Leu-Arg-AMC substrate by fluorescence ...
In DepthDetails ArticlePubMed