BDBM50339296 2-((R)-4-Amino-4-carboxybutanamido)-6-dodecanamidoheptanedioic Acid::CHEMBL1689695
SMILES CCCCCCCCCCCC(=O)NC(CCCC(NC(=O)CC[C@@H](N)C(O)=O)C(O)=O)C(O)=O
InChI Key InChIKey=OKSATHLTROVBTJ-LMDPOFIKSA-N
Data  1 EC50
  Tab Delimited (TSV)   2D SDfile   Computed 3D by Vconf -m prep SDfile
Find this compound or compounds like it in BindingDB:
Activity Spreadsheet -- Enzyme Inhibition Constant Data from BindingDB
Found 1 hit for monomerid = 50339296
TargetNucleotide-binding oligomerization domain-containing protein 1(Homo sapiens (Human))
University Of Kansas
Curated by ChEMBL
LigandPNGBDBM50339296(2-((R)-4-Amino-4-carboxybutanamido)-6-dodecanamido...)
Affinity DataEC50:  0.550nM. Assay description: Agonist activity at human NOD-1 expressed in human HEK293 cells assessed as NFkappaB induction by spectrophotometric analysis
In DepthDetails ArticlePubMed