BDBM50339308 2-Amino-6-((R)-4-dodecanamido-5-ethoxy-5-oxopentanamido)heptanedioic Acid::CHEMBL1689706
SMILES CCCCCCCCCCCC(=O)N[C@H](CCC(=O)NC(CCCC(N)C(O)=O)C(O)=O)C(=O)OCC
InChI Key InChIKey=QNLDHWNRVCPNAH-XVAXZDLZSA-N
Data  1 EC50
  Tab Delimited (TSV)   2D SDfile   Computed 3D by Vconf -m prep SDfile
Find this compound or compounds like it in BindingDB:
Activity Spreadsheet -- Enzyme Inhibition Constant Data from BindingDB
Found 1 hit for monomerid = 50339308
TargetNucleotide-binding oligomerization domain-containing protein 1(Homo sapiens (Human))
University Of Kansas
Curated by ChEMBL
LigandPNGBDBM50339308(2-Amino-6-((R)-4-dodecanamido-5-ethoxy-5-oxopentan...)
Affinity DataEC50:  0.0690nM. Assay description: Agonist activity at human NOD-1 expressed in human HEK293 cells assessed as NFkappaB induction by spectrophotometric analysis
In DepthDetails ArticlePubMed