BDBM50339605 1-Hydroxy-5-phenyl-1H-indole-2-carboxylic Acid::CHEMBL1688788
SMILES OC(=O)c1cc2cc(ccc2n1O)-c1ccccc1
InChI Key InChIKey=RTQWCTDOAZOGRH-UHFFFAOYSA-N
Data  2 KI
  Tab Delimited (TSV)   2D SDfile   Computed 3D by Vconf -m prep SDfile
Find this compound or compounds like it in BindingDB:
Activity Spreadsheet -- Enzyme Inhibition Constant Data from BindingDB
Found 2 hits for monomerid = 50339605
TargetL-lactate dehydrogenase A chain(Homo sapiens (Human))
Universita` Di Pisa
Curated by ChEMBL
LigandPNGBDBM50339605(1-Hydroxy-5-phenyl-1H-indole-2-carboxylic Acid | C...)
Affinity DataKi:  1.04E+4nM. Assay description: Competitive inhibition of human LDH-A using NADH as substrate after 5 mins by calorimetric assay relative to control
In DepthDetails ArticlePubMed
TargetL-lactate dehydrogenase A chain(Homo sapiens (Human))
Universita` Di Pisa
Curated by ChEMBL
LigandPNGBDBM50339605(1-Hydroxy-5-phenyl-1H-indole-2-carboxylic Acid | C...)
Affinity DataKi:  1.57E+4nM. Assay description: Competitive inhibition of human LDH-A using pyruvate as substrate after 5 mins by calorimetric assay relative to control
In DepthDetails ArticlePubMed