BDBM50339780 CHEMBL1689142::N-{7-[4-(4'-Chloro-biphenyl-2-ylmethyl)piperazin-1-yl]quinazolin-4-yl}-4-((R)-3-morpholin-4-yl-1-phenylsulfanylmethyl-propylamino)-3-trifluoromethanesulfonyl-benzenesulfonamide
SMILES FC(F)(F)S(=O)(=O)c1cc(ccc1N[C@H](CCN1CCOCC1)CSc1ccccc1)S(=O)(=O)Nc1ncnc2cc(ccc12)N1CCN(Cc2ccccc2-c2ccc(Cl)cc2)CC1
InChI Key InChIKey=JYASJBDXOVFRBN-PSXMRANNSA-N
Data  4 IC50
  Tab Delimited (TSV)   2D SDfile   Computed 3D by Vconf -m prep SDfile
Find this compound or compounds like it in BindingDB:
Activity Spreadsheet -- Enzyme Inhibition Constant Data from BindingDB
Found 4 hits for monomerid = 50339780
TargetBcl-2-like protein 2(Homo sapiens (Human))
The Walter And Eliza Hall Institute Of Medical Research
Curated by ChEMBL
LigandPNGBDBM50339780(CHEMBL1689142 | N-{7-[4-(4'-Chloro-biphenyl-2-ylme...)
Affinity DataIC50: >1.00E+3nM. Assay description: Displacement of wild type mBimBH3 from human Bcl-w by solution competition assay
In DepthDetails ArticlePubMed
TargetInduced myeloid leukemia cell differentiation protein Mcl-1(Homo sapiens (Human))
The Walter And Eliza Hall Institute Of Medical Research
Curated by ChEMBL
LigandPNGBDBM50339780(CHEMBL1689142 | N-{7-[4-(4'-Chloro-biphenyl-2-ylme...)
Affinity DataIC50: >1.00E+3nM. Assay description: Displacement of wild type mBimBH3 from Mcl-1 by solution competition assay
In DepthDetails ArticlePubMed
TargetApoptosis regulator Bcl-2(Homo sapiens (Human))
The Walter And Eliza Hall Institute Of Medical Research
Curated by ChEMBL
LigandPNGBDBM50339780(CHEMBL1689142 | N-{7-[4-(4'-Chloro-biphenyl-2-ylme...)
Affinity DataIC50:  81nM. Assay description: Displacement of wild type mBimBH3 from human Bcl-2 by solution competition assay
In DepthDetails ArticlePubMed
TargetBcl-2-like protein 1(Homo sapiens (Human))
The Walter And Eliza Hall Institute Of Medical Research
Curated by ChEMBL
LigandPNGBDBM50339780(CHEMBL1689142 | N-{7-[4-(4'-Chloro-biphenyl-2-ylme...)
Affinity DataIC50:  16nM. Assay description: Displacement of biotinylated Bim-BH3 from GST-tagged Bcl-Xl by AlphaSCREEN competitive assay
In DepthDetails ArticlePubMed