BDBM50339792 (S)-2-((2S,3R)-3-amino-2-hydroxyheptanamido)-4-methylpentanoic acid::CHEMBL1689154
SMILES CCCC[C@@H](N)[C@H](O)C(=O)N[C@@H](CC(C)C)C(O)=O
InChI Key InChIKey=XXSHURCWLLVTBO-VWYCJHECSA-N
Data  1 KI
  Tab Delimited (TSV)   2D SDfile   Computed 3D by Vconf -m prep SDfile
Find this compound or compounds like it in BindingDB:
Activity Spreadsheet -- Enzyme Inhibition Constant Data from BindingDB
Found 1 hit for monomerid = 50339792
TargetM1 family aminopeptidase(Plasmodium falciparum (isolate FcB1 / Columbia))
University Of Pennsylvania
Curated by ChEMBL
LigandPNGBDBM50339792((S)-2-((2S,3R)-3-amino-2-hydroxyheptanamido)-4-met...)
Affinity DataKi:  5.30E+3nM. Assay description: Inhibition of Plasmodium falciparum recombinant M1-aminopeptidase expressed in Escherichia coli after 40 mins uisng fluorigenic substrate L-Leucyl-7-...
In DepthDetails ArticlePubMed