BDBM50339869 5-(1-hydroxy-1,3-dihydrobenzo[c][1,2]oxaborol-6-yloxy)pyrazine-2-carboxylic acid::CHEMBL1761275
SMILES OB1OCc2ccc(Oc3cnc(cn3)C(O)=O)cc12
InChI Key InChIKey=ZQEMCCCUMXEPCN-UHFFFAOYSA-N
Data  1 KI
  Tab Delimited (TSV)   2D SDfile   Computed 3D by Vconf -m prep SDfile
Find this compound or compounds like it in BindingDB:
Activity Spreadsheet -- Enzyme Inhibition Constant Data from BindingDB
Found 1 hit for monomerid = 50339869
TargetBeta-lactamase(Enterobacter cloacae)
Anacor Pharmaceuticals
Curated by ChEMBL
LigandPNGBDBM50339869(5-(1-hydroxy-1,3-dihydrobenzo[c][1,2]oxaborol-6-yl...)
Affinity DataKi:  20nM. Assay description: Inhibition of Enterobacter cloacae P99 beta-lactamase AmpC P99 using nitrocefin as substrate after 30 mins by spectrophotometric analysis
In DepthDetails ArticlePubMed