BDBM50340227 4-amino-1-((5-methylisoxazol-3-yl)methyl)-6-(trifluoromethyl)-1H-imidazo[4,5-c]pyridin-2(3H)-one::CHEMBL1760443
SMILES Cc1cc(Cn2c3cc(nc(N)c3[nH]c2=O)C(F)(F)F)no1
InChI Key InChIKey=GGDKZQAZCLVGRA-UHFFFAOYSA-N
Data  1 EC50
  Tab Delimited (TSV)   2D SDfile   Computed 3D by Vconf -m prep SDfile
Find this compound or compounds like it in BindingDB:
Activity Spreadsheet -- Enzyme Inhibition Constant Data from BindingDB
Found 1 hit for monomerid = 50340227
TargetToll-like receptor 7(Homo sapiens (Human))
Pfizer
Curated by ChEMBL
LigandPNGBDBM50340227(4-amino-1-((5-methylisoxazol-3-yl)methyl)-6-(trifl...)
Affinity DataEC50:  103nM. Assay description: Agonist activity at Toll-like receptor 7
In DepthDetails ArticlePubMed