BDBM50340484 (5S)-5-methyl-1-(quinolin-4-ylmethyl)-3-{4-[(trifluoromethyl)sulfonyl]phenyl}imidazolidine-2,4-dione::(S)-5-methyl-1-(quinolin-4-ylmethyl)-3-(4-(trifluoromethylsulfonyl)phenyl)imidazolidine-2,4-dione::CHEMBL1738841::CHEMBL1762153
SMILES Cc1c(O)n(-c2ccc(cc2)S(=O)(=O)C(F)(F)F)c(=O)n1Cc1ccnc2ccccc12
InChI Key InChIKey=PLSQYACXDKUYFC-UHFFFAOYSA-N
Data  9 IC50
  Tab Delimited (TSV)   2D SDfile   Computed 3D by Vconf -m prep SDfile
Find this compound or compounds like it in BindingDB:
Activity Spreadsheet -- Enzyme Inhibition Constant Data from BindingDB
Found 9 hits for monomerid = 50340484
TargetInsulin-like growth factor 1 receptor(Homo sapiens (Human))
Sanofi-Aventis
Curated by ChEMBL
LigandPNGBDBM50340484((5S)-5-methyl-1-(quinolin-4-ylmethyl)-3-{4-[(trifl...)
Affinity DataIC50:  500nM. Assay description: Inhibition of IGF-induced autophosphosphorylation of GST-tagged human IGF1R expressed in SF21 cells by time resolved-fluorescent assay
In DepthDetails ArticlePubMed
TargetInsulin-like growth factor 1 receptor(Homo sapiens (Human))
Sanofi-Aventis
Curated by ChEMBL
LigandPNGBDBM50340484((5S)-5-methyl-1-(quinolin-4-ylmethyl)-3-{4-[(trifl...)
Affinity DataIC50:  300nM. Assay description: Inhibition of IGF-induced autophosphosphorylation of GST-tagged human IGF1R expressed in SF21 cells by time resolved-fluorescent assay
In DepthDetails ArticlePubMed
TargetInsulin receptor(Homo sapiens (Human))
Sanofi-Aventis
Curated by ChEMBL
LigandPNGBDBM50340484((5S)-5-methyl-1-(quinolin-4-ylmethyl)-3-{4-[(trifl...)
Affinity DataIC50:  300nM. Assay description: Inhibition of insulin receptor kinase
In DepthDetails ArticlePubMed
TargetCytochrome P450 3A4(Homo sapiens (Human))
Sanofi-Aventis
Curated by ChEMBL
LigandPNGBDBM50340484((5S)-5-methyl-1-(quinolin-4-ylmethyl)-3-{4-[(trifl...)
Affinity DataIC50: >1.50E+4nM. Assay description: Inhibition of CYP3A4
In DepthDetails ArticlePubMed
TargetInsulin-like growth factor 1 receptor(Homo sapiens (Human))
Sanofi-Aventis
Curated by ChEMBL
LigandPNGBDBM50340484((5S)-5-methyl-1-(quinolin-4-ylmethyl)-3-{4-[(trifl...)
Affinity DataIC50:  600nM. Assay description: Inhibition of autophosphosphorylation of human IGF1R expressed in IGF1-stimulated MCF7 cells by ELISA
In DepthDetails ArticlePubMed
TargetCytochrome P450 2D6(Homo sapiens (Human))
Sanofi-Aventis
Curated by ChEMBL
LigandPNGBDBM50340484((5S)-5-methyl-1-(quinolin-4-ylmethyl)-3-{4-[(trifl...)
Affinity DataIC50: >1.50E+4nM. Assay description: Inhibition of CYP2D6
In DepthDetails ArticlePubMed
TargetCytochrome P450 2C19(Homo sapiens (Human))
Sanofi-Aventis
Curated by ChEMBL
LigandPNGBDBM50340484((5S)-5-methyl-1-(quinolin-4-ylmethyl)-3-{4-[(trifl...)
Affinity DataIC50: >1.50E+4nM. Assay description: Inhibition of CYP2C19
In DepthDetails ArticlePubMed
TargetCytochrome P450 2C9(Homo sapiens (Human))
Sanofi-Aventis
Curated by ChEMBL
LigandPNGBDBM50340484((5S)-5-methyl-1-(quinolin-4-ylmethyl)-3-{4-[(trifl...)
Affinity DataIC50:  700nM. Assay description: Inhibition of CYP2C9
In DepthDetails ArticlePubMed
TargetCytochrome P450 1A2(Homo sapiens (Human))
Sanofi-Aventis
Curated by ChEMBL
LigandPNGBDBM50340484((5S)-5-methyl-1-(quinolin-4-ylmethyl)-3-{4-[(trifl...)
Affinity DataIC50: >1.50E+4nM. Assay description: Inhibition of CYP1A2
In DepthDetails ArticlePubMed