BDBM50340541 (S)-1-((1-(2-fluoroethyl)-1H-1,2,3-triazol-4-yl)methyl)-5-(2-(phenoxymethyl)azetidin-1-ylsulfonyl)indoline-2,3-dione::CHEMBL1762361
SMILES FCCn1cc(CN2C(=O)C(=O)c3cc(ccc23)S(=O)(=O)N2CC[C@H]2COc2ccccc2)nn1
InChI Key InChIKey=RVXFIJCZJQLWSY-KRWDZBQOSA-N
Data  5 IC50  1 EC50
  Tab Delimited (TSV)   2D SDfile   Computed 3D by Vconf -m prep SDfile
Find this compound or compounds like it in BindingDB:
Activity Spreadsheet -- Enzyme Inhibition Constant Data from BindingDB
Found 6 hits for monomerid = 50340541
TargetCaspase-1(Homo sapiens (Human))
Washington University
Curated by ChEMBL
LigandPNGBDBM50340541((S)-1-((1-(2-fluoroethyl)-1H-1,2,3-triazol-4-yl)me...)
Affinity DataIC50: >2.00E+4nM. Assay description: Inhibition of caspase 1 by fluorometric assay
In DepthDetails ArticlePubMed
TargetCaspase-3(Homo sapiens (Human))
Washington University
Curated by ChEMBL
LigandPNGBDBM50340541((S)-1-((1-(2-fluoroethyl)-1H-1,2,3-triazol-4-yl)me...)
Affinity DataIC50:  11nM. Assay description: Inhibition of human caspase 3 by fluorometric assay
In DepthDetails ArticlePubMed
TargetCaspase-3(Homo sapiens (Human))
Washington University
Curated by ChEMBL
LigandPNGBDBM50340541((S)-1-((1-(2-fluoroethyl)-1H-1,2,3-triazol-4-yl)me...)
Affinity DataEC50:  800nM. Assay description: Inhibition of staurosporine induced activation of caspase 3 activation in human Hela cells assessed as hydrolysis of Z-DEVD-R110 substrate by micropl...
In DepthDetails ArticlePubMed
TargetCaspase-7(Homo sapiens (Human))
Washington University
Curated by ChEMBL
LigandPNGBDBM50340541((S)-1-((1-(2-fluoroethyl)-1H-1,2,3-triazol-4-yl)me...)
Affinity DataIC50:  18nM. Assay description: Inhibition of caspase 7 by fluorometric assay
In DepthDetails ArticlePubMed
TargetCaspase-8(Homo sapiens (Human))
Washington University
Curated by ChEMBL
LigandPNGBDBM50340541((S)-1-((1-(2-fluoroethyl)-1H-1,2,3-triazol-4-yl)me...)
Affinity DataIC50: >5.00E+4nM. Assay description: Inhibition of caspase 8 by fluorometric assay
In DepthDetails ArticlePubMed
TargetCaspase-6(Homo sapiens (Human))
Washington University
Curated by ChEMBL
LigandPNGBDBM50340541((S)-1-((1-(2-fluoroethyl)-1H-1,2,3-triazol-4-yl)me...)
Affinity DataIC50:  6.95E+3nM. Assay description: Inhibition of caspase 6 by fluorometric assay
In DepthDetails ArticlePubMed