BDBM50340555 (4-methyl-3-(methyl(2-(3-(methylsulfonyl)-5-morpholinophenylamino)pyrimidin-4-yl)amino)phenyl)methanol::CHEMBL1762546
SMILES CN(c1ccnc(Nc2cc(cc(c2)S(C)(=O)=O)N2CCOCC2)n1)c1cc(CO)ccc1C
InChI Key InChIKey=IVWHSTCJCURGMH-UHFFFAOYSA-N
Data  4 IC50
PDB links: 1 PDB ID matches this monomer.
  Tab Delimited (TSV)   2D SDfile   Computed 3D by Vconf -m prep SDfile
Find this compound or compounds like it in BindingDB:
Activity Spreadsheet -- Enzyme Inhibition Constant Data from BindingDB
Found 4 hits for monomerid = 50340555
TargetEphrin type-B receptor 4(Homo sapiens (Human))
Astrazeneca
Curated by ChEMBL
LigandPNGBDBM50340555((4-methyl-3-(methyl(2-(3-(methylsulfonyl)-5-morpho...)
Affinity DataIC50:  11nM. Assay description: Inhibition of human EphB4 autophosphorylation expressed in CHOK1 cells
In DepthDetails ArticlePubMed
TargetSerine/threonine-protein kinase PAK 1(Homo sapiens (Human))
Astrazeneca
Curated by ChEMBL
LigandPNGBDBM50340555((4-methyl-3-(methyl(2-(3-(methylsulfonyl)-5-morpho...)
Affinity DataIC50:  3.10E+3nM. Assay description: Inhibition of PAK1 phosphorylation in human MCF10A cells
TargetSerine/threonine-protein kinase PAK 1(Homo sapiens (Human))
Astrazeneca
Curated by ChEMBL
LigandPNGBDBM50340555((4-methyl-3-(methyl(2-(3-(methylsulfonyl)-5-morpho...)
Affinity DataIC50:  100nM. Assay description: Inhibition of PAK1 (unknown origin) by ATP-kinaseGlo assay
TargetEphrin type-B receptor 4(Homo sapiens (Human))
Astrazeneca
Curated by ChEMBL
LigandPNGBDBM50340555((4-methyl-3-(methyl(2-(3-(methylsulfonyl)-5-morpho...)
Affinity DataIC50:  3nM. Assay description: Inhibition of human EPHB4
In DepthDetails ArticlePubMed