BDBM50340756 (S)-6-(4-chlorobenzylamino)-2-(4-fluoro-3-methylbenzyl)-N-hydroxyhexanamide::CHEMBL1760451
SMILES Cc1cc(C[C@H](CCCCNCc2ccc(Cl)cc2)C(=O)NO)ccc1F
InChI Key InChIKey=XVGLJDLJQKFULQ-SFHVURJKSA-N
Data  1 KI
  Tab Delimited (TSV)   2D SDfile   Computed 3D by Vconf -m prep SDfile
Find this compound or compounds like it in BindingDB:
Activity Spreadsheet -- Enzyme Inhibition Constant Data from BindingDB
Found 1 hit for monomerid = 50340756
TargetLethal factor(Bacillus anthracis)
Panthera Biopharma
Curated by ChEMBL
LigandPNGBDBM50340756((S)-6-(4-chlorobenzylamino)-2-(4-fluoro-3-methylbe...)
Affinity DataKi:  0.360nM. Assay description: Inhibition of Bacillus anthracis lethal factor assessed as proteolysis using MCA-KKVYPYPME-Dap(Dnp)-NH2 peptide substrate after 4 hrs by FRET assay
In DepthDetails ArticlePubMed