BDBM50341084 (3-(4-chlorophenyl)-1H-pyrazol-5-yl)(4-(pyridin-2-ylmethyl)piperazin-1-yl)methanone::CHEMBL1760340
SMILES Clc1ccc(cc1)-c1cc([nH]n1)C(=O)N1CCN(Cc2ccccn2)CC1
InChI Key InChIKey=VRDMARSJNVEFRA-UHFFFAOYSA-N
Data  1 IC50
  Tab Delimited (TSV)   2D SDfile   Computed 3D by Vconf -m prep SDfile
Find this compound or compounds like it in BindingDB:
Activity Spreadsheet -- Enzyme Inhibition Constant Data from BindingDB
Found 1 hit for monomerid = 50341084
TargetNeuromedin-K receptor(Homo sapiens (Human))
Euroscreen
Curated by ChEMBL
LigandPNGBDBM50341084((3-(4-chlorophenyl)-1H-pyrazol-5-yl)(4-(pyridin-2-...)
Affinity DataIC50:  5.09E+3nM. Assay description: Antagonist activity at human recombinant NK3 receptor expressed in CHO cells assessed as inhibition of NKB-induced increase of intracellular calcium ...
In DepthDetails ArticlePubMed