BDBM50341088 (3-(4-chlorophenyl)-1H-pyrazol-5-yl)(4-(3-methoxyphenyl)piperazin-1-yl)methanone::CHEMBL1760344
SMILES COc1cccc(c1)N1CCN(CC1)C(=O)c1cc(n[nH]1)-c1ccc(Cl)cc1
InChI Key InChIKey=NRJUYFYUTKQALH-UHFFFAOYSA-N
Data  1 IC50
  Tab Delimited (TSV)   2D SDfile   Computed 3D by Vconf -m prep SDfile
Find this compound or compounds like it in BindingDB:
Activity Spreadsheet -- Enzyme Inhibition Constant Data from BindingDB
Found 1 hit for monomerid = 50341088
TargetNeuromedin-K receptor(Homo sapiens (Human))
Euroscreen
Curated by ChEMBL
LigandPNGBDBM50341088((3-(4-chlorophenyl)-1H-pyrazol-5-yl)(4-(3-methoxyp...)
Affinity DataIC50: >1.00E+4nM. Assay description: Antagonist activity at human recombinant NK3 receptor expressed in CHO cells assessed as inhibition of NKB-induced increase of intracellular calcium ...
In DepthDetails ArticlePubMed