BDBM50341120 4-methyl-N-(3-(1-methyl-1H-pyrazol-4-yl)-5-(trifluoromethyl)phenyl)-3-(4-(pyridin-3-yl)thiazol-2-ylamino)benzamide::CHEMBL1760366
SMILES Cc1ccc(cc1Nc1nc(cs1)-c1cccnc1)C(=O)Nc1cc(cc(c1)C(F)(F)F)-c1cnn(C)c1
InChI Key InChIKey=XTWQOJKEOSZUSS-UHFFFAOYSA-N
Data  1 IC50
  Tab Delimited (TSV)   2D SDfile   Computed 3D by Vconf -m prep SDfile
Find this compound or compounds like it in BindingDB:
Activity Spreadsheet -- Enzyme Inhibition Constant Data from BindingDB
Found 1 hit for monomerid = 50341120
TargetBreakpoint cluster region protein/Tyrosine-protein kinase ABL1(Homo sapiens (Human))
Chinese Academy Of Sciences
Curated by ChEMBL
LigandPNGBDBM50341120(4-methyl-N-(3-(1-methyl-1H-pyrazol-4-yl)-5-(triflu...)
Affinity DataIC50:  491nM. Assay description: Inhibition of Bcr/Abl by FRET-based Z-lyte assay
In DepthDetails ArticlePubMed