BDBM50341153 4-(3-(anthracen-9-yl)-4,5-dihydro-1H-pyrazol-5-yl)phenol::CHEMBL1760714
SMILES Oc1ccc(cc1)C1CC(N=N1)c1c2ccccc2cc2ccccc12
InChI Key InChIKey=GAZUTEYOOWJEAA-UHFFFAOYSA-N
Data  4 KI
  Tab Delimited (TSV)   2D SDfile   Computed 3D by Vconf -m prep SDfile
Find this compound or compounds like it in BindingDB:
Activity Spreadsheet -- Enzyme Inhibition Constant Data from BindingDB
Found 4 hits for monomerid = 50341153
TargetAmine oxidase [flavin-containing] B(Rattus norvegicus (rat))
Birla Institute Of Technology
Curated by ChEMBL
LigandPNGBDBM50341153(4-(3-(anthracen-9-yl)-4,5-dihydro-1H-pyrazol-5-yl)...)
Affinity DataKi:  6.75nM. Assay description: Competitive inhibition of rat liver MAO-B after 60 mins using p-tyramine as substrate by spectrophotometry
In DepthDetails ArticlePubMed
TargetAmine oxidase [flavin-containing] B(Homo sapiens (Human))
Birla Institute Of Technology
Curated by ChEMBL
LigandPNGBDBM50341153(4-(3-(anthracen-9-yl)-4,5-dihydro-1H-pyrazol-5-yl)...)
Affinity DataKi:  7.51nM. Assay description: Competitive inhibition of human recombinant MAO-B after 60 mins using p-tyramine as substrate by spectrophotometry
In DepthDetails ArticlePubMed
TargetAmine oxidase [flavin-containing] A(Homo sapiens (Human))
Birla Institute Of Technology
Curated by ChEMBL
LigandPNGBDBM50341153(4-(3-(anthracen-9-yl)-4,5-dihydro-1H-pyrazol-5-yl)...)
Affinity DataKi:  225nM. Assay description: Competitive inhibition of human recombinant MAO-A after 60 mins using p-tyramine as substrate by spectrophotometry
In DepthDetails ArticlePubMed
TargetAmine oxidase [flavin-containing] A(Rattus norvegicus (rat))
Birla Institute Of Technology
Curated by ChEMBL
LigandPNGBDBM50341153(4-(3-(anthracen-9-yl)-4,5-dihydro-1H-pyrazol-5-yl)...)
Affinity DataKi:  385nM. Assay description: Competitive inhibition of rat liver MAO-A after 60 mins using p-tyramine as substrate by spectrophotometry
In DepthDetails ArticlePubMed