BDBM50341213 1-(3-chloro-4-fluorophenyl)-9-(1H-pyrrolo[2,3-b]pyridin-5-yl)benzo[h][1,6]naphthyridin-2(1H)-one::CHEMBL1765707
SMILES Fc1ccc(cc1Cl)-n1c2c(ccc1=O)cnc1ccc(cc21)-c1cnc2[nH]ccc2c1
InChI Key InChIKey=JFVAUGIKDLXENP-UHFFFAOYSA-N
Data  2 EC50
  Tab Delimited (TSV)   2D SDfile   Computed 3D by Vconf -m prep SDfile
Find this compound or compounds like it in BindingDB:
Activity Spreadsheet -- Enzyme Inhibition Constant Data from BindingDB
Found 2 hits for monomerid = 50341213
TargetPhosphatidylinositol 4,5-bisphosphate 3-kinase catalytic subunit alpha isoform(Homo sapiens (Human))
Dana-Farber Cancer Institute
Curated by ChEMBL
LigandPNGBDBM50341213(1-(3-chloro-4-fluorophenyl)-9-(1H-pyrrolo[2,3-b]py...)
Affinity DataEC50:  750nM. Assay description: Inhibition of PI3Kalpha in human PC3 cells expressing Akt1 S473D mutant assessed as phosphorylation of Akt Thr308 by immunoblotting
In DepthDetails ArticlePubMed
TargetSerine/threonine-protein kinase mTOR(Mus musculus (Mouse))
Dana-Farber Cancer Institute
Curated by ChEMBL
LigandPNGBDBM50341213(1-(3-chloro-4-fluorophenyl)-9-(1H-pyrrolo[2,3-b]py...)
Affinity DataEC50:  1nM. Assay description: Inhibition of mTOR in p53-deficient MEF assessed as phosphorylation of S6K1 at Thr389 by immunoblotting
In DepthDetails ArticlePubMed