BDBM50341520 3-(4-(Piperidin-1-yl)benzoylamino)-5-(pyridin-4-yl)-(1H)-pyridin-2-one::CHEMBL1765097
SMILES O=C(Nc1cc(c[nH]c1=O)-c1ccncc1)c1ccc(cc1)N1CCCCC1
InChI Key InChIKey=ABBVAIMDGQMDHS-UHFFFAOYSA-N
Data  7 KI
PDB links: 1 PDB ID matches this monomer.
  Tab Delimited (TSV)   2D SDfile   Computed 3D by Vconf -m prep SDfile
Find this compound or compounds like it in BindingDB:
Activity Spreadsheet -- Enzyme Inhibition Constant Data from BindingDB
Found 7 hits for monomerid = 50341520
TargetMast/stem cell growth factor receptor Kit(Homo sapiens (Human))
Vertex Pharmaceuticals
Curated by ChEMBL
LigandPNGBDBM50341520(3-(4-(Piperidin-1-yl)benzoylamino)-5-(pyridin-4-yl...)
Affinity DataKi:  12nM. Assay description: Inhibition of KIT
In DepthDetails ArticlePubMed
TargetReceptor-type tyrosine-protein kinase FLT3(Homo sapiens (Human))
Vertex Pharmaceuticals
Curated by ChEMBL
LigandPNGBDBM50341520(3-(4-(Piperidin-1-yl)benzoylamino)-5-(pyridin-4-yl...)
Affinity DataKi:  32nM. Assay description: Inhibition of FMS
In DepthDetails ArticlePubMed
TargetTyrosine-protein kinase ITK/TSK(Homo sapiens (Human))
Vertex Pharmaceuticals
Curated by ChEMBL
LigandPNGBDBM50341520(3-(4-(Piperidin-1-yl)benzoylamino)-5-(pyridin-4-yl...)
Affinity DataKi:  93nM. Assay description: Inhibition of Itk after 40 mins by radiometric phosphate incorporation assay
In DepthDetails ArticlePubMed
TargetProto-oncogene tyrosine-protein kinase Src(Homo sapiens (Human))
Vertex Pharmaceuticals
Curated by ChEMBL
LigandPNGBDBM50341520(3-(4-(Piperidin-1-yl)benzoylamino)-5-(pyridin-4-yl...)
Affinity DataKi:  1.80E+3nM. Assay description: Inhibition of SRC
In DepthDetails ArticlePubMed
TargetAurora kinase A(Homo sapiens (Human))
The Institute Of Cancer Research
Curated by ChEMBL
LigandPNGBDBM50341520(3-(4-(Piperidin-1-yl)benzoylamino)-5-(pyridin-4-yl...)
Affinity DataKi:  2.60E+3nM. Assay description: Inhibition of full length N-terminal His-tagged Aurora A (unknown origin) using fluorescence-labeled FL-Peptide 21 as substrate after 60 mins in pres...
In DepthDetails ArticlePubMed
TargetDual specificity protein kinase TTK(Homo sapiens (Human))
The Institute Of Cancer Research
Curated by ChEMBL
LigandPNGBDBM50341520(3-(4-(Piperidin-1-yl)benzoylamino)-5-(pyridin-4-yl...)
Affinity DataKi:  2.90E+3nM. Assay description: Inhibition of full length human Mps1 using fluorescence-labeled H236 peptide as substrate after 60 to 90 mins in presence of ATP by fluorescence assa...
TargetAurora kinase B/Inner centromere protein(Homo sapiens (Human))
The Institute Of Cancer Research
Curated by ChEMBL
LigandPNGBDBM50341520(3-(4-(Piperidin-1-yl)benzoylamino)-5-(pyridin-4-yl...)
Affinity DataKi:  7.40E+3nM. Assay description: Inhibition of human full length N-terminal GST-tagged Aurora B (1 to 344 end residues)/His-tagged INCENP (803 to 918 end residues) expressed in bacul...
In DepthDetails ArticlePubMed