BDBM50341557 CHEMBL262079::ethyl 2-(2-(2-(4-methoxyphenylamino)-2-oxoethyl)-1-oxo-1,2-dihydroisoquinolin-5-yloxy)propanoate
SMILES CCOC(=O)C(C)Oc1cccc2c1ccn(CC(=O)Nc1ccc(OC)cc1)c2=O
InChI Key InChIKey=CFQXBSFRUQKYQA-UHFFFAOYSA-N
Data  1 IC50
  Tab Delimited (TSV)   2D SDfile   Computed 3D by Vconf -m prep SDfile
Find this compound or compounds like it in BindingDB:
Activity Spreadsheet -- Enzyme Inhibition Constant Data from BindingDB
Found 1 hit for monomerid = 50341557
TargetSteroidogenic factor 1(Homo sapiens (Human))
University Of Southampton
Curated by ChEMBL
LigandPNGBDBM50341557(CHEMBL262079 | ethyl 2-(2-(2-(4-methoxyphenylamino...)
Affinity DataIC50:  200nM. Assay description: Inverse agonist activity at SF-1
In DepthDetails ArticlePubMed