BDBM50341627 3-(4-Methylpiperazin-1-yl)-5-(3-nitrobenzylamino)-7-(trifluoromethyl)quinoline::CHEMBL1766528
SMILES CN1CCN(CC1)c1cnc2cc(cc(NCc3cccc(c3)[N+]([O-])=O)c2c1)C(F)(F)F
InChI Key InChIKey=JIYPGFPFAVEPFX-UHFFFAOYSA-N
Data  1 IC50
PDB links: 1 PDB ID matches this monomer.
  Tab Delimited (TSV)   2D SDfile   Computed 3D by Vconf -m prep SDfile
Find this compound or compounds like it in BindingDB:
Activity Spreadsheet -- Enzyme Inhibition Constant Data from BindingDB
Found 1 hit for monomerid = 50341627
TargetHepatocyte growth factor receptor(Homo sapiens (Human))
Chinese Academy Of Sciences
Curated by ChEMBL
LigandPNGBDBM50341627(3-(4-Methylpiperazin-1-yl)-5-(3-nitrobenzylamino)-...)
Affinity DataIC50:  0.930nM. Assay description: Inhibition of purified recombinant c-Met after 60 mins by ELISA