BDBM50341763 2-Phenyl-5-trifluoromethyloxazole-4-carboxylic Acid{2-[(2-Methoxyethyl)methylamino]pyrimidin-5-yl}amide::CHEMBL1766816
SMILES COCCN(C)c1ncc(NC(=O)c2nc(oc2C(F)(F)F)-c2ccccc2)cn1
InChI Key InChIKey=ZQOHEEKXXKJSHZ-UHFFFAOYSA-N
Data  1 IC50  1 EC50
  Tab Delimited (TSV)   2D SDfile   Computed 3D by Vconf -m prep SDfile
Find this compound or compounds like it in BindingDB:
Activity Spreadsheet -- Enzyme Inhibition Constant Data from BindingDB
Found 2 hits for monomerid = 50341763
TargetDiacylglycerol O-acyltransferase 1(Homo sapiens (Human))
Hoffmann-La Roche
Curated by ChEMBL
LigandPNGBDBM50341763(2-Phenyl-5-trifluoromethyloxazole-4-carboxylic Aci...)
Affinity DataIC50:  48nM. Assay description: Inhibition of human DGAT1 expressed in baculovirus infected insect cells after 1 hr using palmitoyl-1-14C-coenzyme A by phospholipid flashplate assay
In DepthDetails ArticlePubMed
TargetDiacylglycerol O-acyltransferase 1(Homo sapiens (Human))
Hoffmann-La Roche
Curated by ChEMBL
LigandPNGBDBM50341763(2-Phenyl-5-trifluoromethyloxazole-4-carboxylic Aci...)
Affinity DataEC50:  534nM. Assay description: Inhibition of human DGAT1 expressed in CHO-K1 cells after 1 hr using palmitoyl-1-14C-coenzyme A by phospholipid flashplate assay
In DepthDetails ArticlePubMed