BDBM50341809 (1S,2R,3R)-1-(7-Fluoro-1,2,3,4-tetrahydropyrido[3'4':3,4]pyrazolo[1,5-a]pyridine-2-sulfonylamino)-2-methyl-3-phenylcyclopropanecarboxylicAcid::CHEMBL1767011
SMILES C[C@@H]1[C@H](c2ccccc2)[C@]1(NS(=O)(=O)N1CCc2c(C1)nn1cc(F)ccc21)C(O)=O
InChI Key InChIKey=KIMAXDZENSBFAC-DYHNYNMBSA-N
Data  4 IC50
  Tab Delimited (TSV)   2D SDfile   Computed 3D by Vconf -m prep SDfile
Find this compound or compounds like it in BindingDB:
Activity Spreadsheet -- Enzyme Inhibition Constant Data from BindingDB
Found 4 hits for monomerid = 50341809
TargetA disintegrin and metalloproteinase with thrombospondin motifs 5(Homo sapiens (Human))
Central Pharmaceutical Research Institute
Curated by ChEMBL
LigandPNGBDBM50341809((1S,2R,3R)-1-(7-Fluoro-1,2,3,4-tetrahydropyrido[3'...)
Affinity DataIC50:  8.60nM. Assay description: Inhibition of human recombinant aggrecanase 2 after 150 mins by fluorescence plate reader
In DepthDetails ArticlePubMed
TargetDisintegrin and metalloproteinase domain-containing protein 17(Homo sapiens (Human))
Central Pharmaceutical Research Institute
Curated by ChEMBL
LigandPNGBDBM50341809((1S,2R,3R)-1-(7-Fluoro-1,2,3,4-tetrahydropyrido[3'...)
Affinity DataIC50: >1.00E+4nM. Assay description: Inhibition of human recombinant TACE after 60 mins by fluorescence plate reader
In DepthDetails ArticlePubMed
TargetInterstitial collagenase(Homo sapiens (Human))
Central Pharmaceutical Research Institute
Curated by ChEMBL
LigandPNGBDBM50341809((1S,2R,3R)-1-(7-Fluoro-1,2,3,4-tetrahydropyrido[3'...)
Affinity DataIC50:  4.20E+3nM. Assay description: Inhibition of human recombinant MMP1 after 60 mins by fluorescence plate reader
In DepthDetails ArticlePubMed
TargetMatrix metalloproteinase-14(Homo sapiens (Human))
Central Pharmaceutical Research Institute
Curated by ChEMBL
LigandPNGBDBM50341809((1S,2R,3R)-1-(7-Fluoro-1,2,3,4-tetrahydropyrido[3'...)
Affinity DataIC50:  140nM. Assay description: Inhibition of human recombinant MMP14 after 60 mins by fluorescence plate reader
In DepthDetails ArticlePubMed