BDBM50342222 CHEMBL1766446::N-(3-cyanophenyl)-2-(5-(6-methylpyridin-2-yl)-4-(quinolin-6-yl)-1H-pyrazol-1-yl)acetamide
SMILES Cc1cccc(n1)-c1c(cnn1CC(=O)Nc1cccc(c1)C#N)-c1ccc2ncccc2c1
InChI Key InChIKey=FOZLNQNDWJTLKU-UHFFFAOYSA-N
Data  2 IC50
  Tab Delimited (TSV)   2D SDfile   Computed 3D by Vconf -m prep SDfile
Find this compound or compounds like it in BindingDB:
Activity Spreadsheet -- Enzyme Inhibition Constant Data from BindingDB
Found 2 hits for monomerid = 50342222
TargetTGF-beta receptor type-1(Homo sapiens (Human))
Ewha Womans University
Curated by ChEMBL
LigandPNGBDBM50342222(CHEMBL1766446 | N-(3-cyanophenyl)-2-(5-(6-methylpy...)
Affinity DataIC50: >1.00E+3nM. Assay description: Inhibition of human recombinant p38alpha expressed in Escherichia coli using ATF2 as a substrate by radioisotopic protein kinase assay
In DepthDetails ArticlePubMed
TargetTGF-beta receptor type-1(Homo sapiens (Human))
Ewha Womans University
Curated by ChEMBL
LigandPNGBDBM50342222(CHEMBL1766446 | N-(3-cyanophenyl)-2-(5-(6-methylpy...)
Affinity DataIC50: >1.00E+3nM. Assay description: Inhibition of human recombinant GST-fused ALK5 expressed in Sf9 cells
In DepthDetails ArticlePubMed