BDBM50342233 CHEMBL1766708::difluoro(4'-((furan-3-ylmethyleneaminooxy)methyl)biphenyl-3-yl)methylphosphonic acid
SMILES OP(O)(=O)C(F)(F)c1cccc(c1)-c1ccc(CO\N=C\c2ccoc2)cc1
InChI Key InChIKey=UTGFLDBPSATYCR-SSDVNMTOSA-N
Data  1 IC50
  Tab Delimited (TSV)   2D SDfile   Computed 3D by Vconf -m prep SDfile
Find this compound or compounds like it in BindingDB:
Activity Spreadsheet -- Enzyme Inhibition Constant Data from BindingDB
Found 1 hit for monomerid = 50342233
TargetProtein-tyrosine-phosphatase(Yersinia pestis)
National Cancer Institute-Frederick
Curated by ChEMBL
LigandPNGBDBM50342233(CHEMBL1766708 | difluoro(4'-((furan-3-ylmethylenea...)
Affinity DataIC50:  3.69E+3nM. Assay description: Inhibition of Yersinia pestis outer protein H expressed in Escherichia coli after 15 to 20 mins
In DepthDetails ArticlePubMed