BDBM50342297 (6-Bromo-2-ethyl-7-hydroxybenzofuran-4-yl)(4-methoxyphenyl)methanone::CHEMBL1767117
SMILES CCc1cc2c(cc(Br)c(O)c2o1)C(=O)c1ccc(OC)cc1
InChI Key InChIKey=OUIKBAUKQYEGQB-UHFFFAOYSA-N
Data  1 IC50
  Tab Delimited (TSV)   2D SDfile   Computed 3D by Vconf -m prep SDfile
Find this compound or compounds like it in BindingDB:
Activity Spreadsheet -- Enzyme Inhibition Constant Data from BindingDB
Found 1 hit for monomerid = 50342297
TargetSolute carrier family 22 member 12(Homo sapiens (Human))
University Of Colorado Anschutz Medical Campus
Curated by ChEMBL
LigandPNGBDBM50342297((6-Bromo-2-ethyl-7-hydroxybenzofuran-4-yl)(4-metho...)
Affinity DataIC50:  772nM. Assay description: Inhibition of human URAT1 expressed in xenopus oocyte assessed as inhibition of [14C]-labelled urate uptake after 60 mins by liquid scintillation cou...
In DepthDetails ArticlePubMed