BDBM50342320 2-(2-(2-iodophenyl)acetamido)thiophene-3-carboxamide::CHEMBL1767263
SMILES NC(=O)c1ccsc1NC(=O)Cc1ccccc1I
InChI Key InChIKey=HIVANCGVXVVVLQ-UHFFFAOYSA-N
Data  1 IC50
  Tab Delimited (TSV)   2D SDfile   Computed 3D by Vconf -m prep SDfile
Find this compound or compounds like it in BindingDB:
Activity Spreadsheet -- Enzyme Inhibition Constant Data from BindingDB
Found 1 hit for monomerid = 50342320
TargetMitogen-activated protein kinase 8(Homo sapiens (Human))
Sanford-Burnham Medical Research Institute
Curated by ChEMBL
LigandPNGBDBM50342320(2-(2-(2-iodophenyl)acetamido)thiophene-3-carboxami...)
Affinity DataIC50:  3.40E+3nM. Assay description: Inhibition of JNK1 by TR-FRET assay
In DepthDetails ArticlePubMed