BDBM50342426 4-methoxy-4-oxobut-2-enoic acid::CHEMBL589586::methyl fumarate
SMILES COC(=O)\C=C\C(O)=O
InChI Key InChIKey=NKHAVTQWNUWKEO-NSCUHMNNSA-N
Data  1 KI
PDB links: 1 PDB ID matches this monomer.
  Tab Delimited (TSV)   2D SDfile   Computed 3D by Vconf -m prep SDfile
Find this compound or compounds like it in BindingDB:
Activity Spreadsheet -- Enzyme Inhibition Constant Data from BindingDB
Found 1 hit for monomerid = 50342426
TargetHydroxycarboxylic acid receptor 2(Homo sapiens (Human))
Leiden University
Curated by ChEMBL
LigandPNGBDBM50342426(4-methoxy-4-oxobut-2-enoic acid | CHEMBL589586 | m...)
Affinity DataKi:  180nM. Assay description: Displacement of [3H]nicotinic acid from human GPR109a receptor expressed in human HEK293T cells by liquid scintillation counting
In DepthDetails ArticlePubMed