BDBM50342455 (R)-cyclobutyl(2-(3-(thiophen-2-yl)-1,2,4-oxadiazol-5-yl)piperidin-1-yl)methanone::CHEMBL1771626
SMILES O=C(C1CCC1)N1CCCC[C@@H]1c1nc(no1)-c1cccs1
InChI Key InChIKey=LWXCJIJKIBWRNV-GFCCVEGCSA-N
Data  1 IC50
  Tab Delimited (TSV)   2D SDfile   Computed 3D by Vconf -m prep SDfile
Find this compound or compounds like it in BindingDB:
Activity Spreadsheet -- Enzyme Inhibition Constant Data from BindingDB
Found 1 hit for monomerid = 50342455
TargetMetabotropic glutamate receptor 5(Homo sapiens (Human))
Vanderbilt University Medical Center
Curated by ChEMBL
LigandPNGBDBM50342455((R)-cyclobutyl(2-(3-(thiophen-2-yl)-1,2,4-oxadiazo...)
Affinity DataIC50:  3.50E+3nM. Assay description: Negative allosteric modulator activity at mGluR5 receptor expressed in HEK293A cells assessed as inhibition of glutamate-induced calcium flux preincu...
In DepthDetails ArticlePubMed