BDBM50342556 (E)-7-bromo-3-(2-oxo-2-(pyridin-3-yl)ethylidene)indolin-2-one::CHEMBL1770547
SMILES Brc1cccc2\C(=C/C(=O)c3cccnc3)C(=O)Nc12
InChI Key InChIKey=OWPAVLUZKPJKLG-YRNVUSSQSA-N
Data  2 IC50
  Tab Delimited (TSV)   2D SDfile   Computed 3D by Vconf -m prep SDfile
Find this compound or compounds like it in BindingDB:
Activity Spreadsheet -- Enzyme Inhibition Constant Data from BindingDB
Found 2 hits for monomerid = 50342556
TargetProtein-glutamine gamma-glutamyltransferase 2(Homo sapiens (Human))
Stanford University
Curated by ChEMBL
LigandPNGBDBM50342556((E)-7-bromo-3-(2-oxo-2-(pyridin-3-yl)ethylidene)in...)
Affinity DataIC50:  2.90E+3nM. Assay description: Inhibition of human transglutaminase 2 using Cbz-Gln-Gly as a substrate by GDH-coupled assay
In DepthDetails ArticlePubMed
TargetProtein-glutamine gamma-glutamyltransferase 2(Homo sapiens (Human))
Stanford University
Curated by ChEMBL
LigandPNGBDBM50342556((E)-7-bromo-3-(2-oxo-2-(pyridin-3-yl)ethylidene)in...)
Affinity DataIC50:  3.20E+3nM. Assay description: Inhibition of human transglutaminase 2 using ZGBC as a substrate after 30 to 60 mins by fluorometric assay
In DepthDetails ArticlePubMed