BDBM50342648 2-methyl-4-(4-(6-methylpyridin-2-ylamino)phenyl)but-3-yn-2-ol::CHEMBL1770751
SMILES Cc1cccc(Nc2ccc(cc2)C#CC(C)(C)O)n1
InChI Key InChIKey=KCYPEQGZOUORMP-UHFFFAOYSA-N
Data  1 IC50
  Tab Delimited (TSV)   2D SDfile   Computed 3D by Vconf -m prep SDfile
Find this compound or compounds like it in BindingDB:
Activity Spreadsheet -- Enzyme Inhibition Constant Data from BindingDB
Found 1 hit for monomerid = 50342648
TargetAcid-sensing ion channel 3(Homo sapiens (Human))
Merck Research Laboratories
Curated by ChEMBL
LigandPNGBDBM50342648(2-methyl-4-(4-(6-methylpyridin-2-ylamino)phenyl)bu...)
Affinity DataIC50:  1.70E+4nM. Assay description: Inhibition of human ASIC3 expressed in HEK293 cells assessed as inhibition of acid-evoked current by manual patch-clamp electrophysiology assay
In DepthDetails ArticlePubMed