BDBM50343013 CHEMBL1770963::N2-isopropyl-N2-methyl-4-(4-methylpiperazin-1-yl)pyridine-2,6-diamine
SMILES CC(C)N(C)c1cc(cc(N)n1)N1CCN(C)CC1
InChI Key InChIKey=OCWNZRZQIIWTCT-UHFFFAOYSA-N
Data  1 KI
  Tab Delimited (TSV)   2D SDfile   Computed 3D by Vconf -m prep SDfile
Find this compound or compounds like it in BindingDB:
Activity Spreadsheet -- Enzyme Inhibition Constant Data from BindingDB
Found 1 hit for monomerid = 50343013
TargetHistamine H4 receptor(Homo sapiens (Human))
Johnson & Johnson Pharmaceutical Research & Development
Curated by ChEMBL
LigandPNGBDBM50343013(CHEMBL1770963 | N2-isopropyl-N2-methyl-4-(4-methyl...)
Affinity DataKi:  189nM. Assay description: Displacement of [3H]histamine from human histamine H4 receptor
In DepthDetails ArticlePubMed