BDBM50343078 CHEMBL1771213::N-hydroxy-4-(4-(4-(4-methoxybenzoyl)piperazin-1-yl)phenylsulfonyl)tetrahydro-2H-pyran-4-carboxamide
SMILES COc1ccc(cc1)C(=O)N1CCN(CC1)c1ccc(cc1)S(=O)(=O)C1(CCOCC1)C(=O)NO
InChI Key InChIKey=QCRPOQONCVCBFI-UHFFFAOYSA-N
Data  2 KI  6 IC50
  Tab Delimited (TSV)   2D SDfile   Computed 3D by Vconf -m prep SDfile
Find this compound or compounds like it in BindingDB:
Activity Spreadsheet -- Enzyme Inhibition Constant Data from BindingDB
Found 8 hits for monomerid = 50343078
TargetInterstitial collagenase(Homo sapiens (Human))
Pfizer
Curated by ChEMBL
LigandPNGBDBM50343078(CHEMBL1771213 | N-hydroxy-4-(4-(4-(4-methoxybenzoy...)
Affinity DataKi: >1.00E+4nM. Assay description: Inhibition of human MMP-1
In DepthDetails ArticlePubMed
TargetMatrix metalloproteinase-14(Homo sapiens (Human))
Pfizer
Curated by ChEMBL
LigandPNGBDBM50343078(CHEMBL1771213 | N-hydroxy-4-(4-(4-(4-methoxybenzoy...)
Affinity DataKi: >1.00E+4nM. Assay description: Inhibition of human MMP-14
In DepthDetails ArticlePubMed
TargetStromelysin-1(Homo sapiens (Human))
Pfizer
Curated by ChEMBL
LigandPNGBDBM50343078(CHEMBL1771213 | N-hydroxy-4-(4-(4-(4-methoxybenzoy...)
Affinity DataIC50:  90nM. Assay description: Inhibition of human MMP-3
In DepthDetails ArticlePubMed
TargetMatrilysin(Homo sapiens (Human))
Pfizer
Curated by ChEMBL
LigandPNGBDBM50343078(CHEMBL1771213 | N-hydroxy-4-(4-(4-(4-methoxybenzoy...)
Affinity DataIC50: >1.00E+4nM. Assay description: Inhibition of human MMP-7
In DepthDetails ArticlePubMed
TargetNeutrophil collagenase(Homo sapiens (Human))
Pfizer
Curated by ChEMBL
LigandPNGBDBM50343078(CHEMBL1771213 | N-hydroxy-4-(4-(4-(4-methoxybenzoy...)
Affinity DataIC50:  1.20E+3nM. Assay description: Inhibition of human MMP-8
In DepthDetails ArticlePubMed
TargetCollagenase 3(Homo sapiens (Human))
Pfizer
Curated by ChEMBL
LigandPNGBDBM50343078(CHEMBL1771213 | N-hydroxy-4-(4-(4-(4-methoxybenzoy...)
Affinity DataIC50:  0.700nM. Assay description: Inhibition of human MMP-13
In DepthDetails ArticlePubMed
TargetMatrix metalloproteinase-9(Homo sapiens (Human))
Pfizer
Curated by ChEMBL
LigandPNGBDBM50343078(CHEMBL1771213 | N-hydroxy-4-(4-(4-(4-methoxybenzoy...)
Affinity DataIC50:  1.20E+3nM. Assay description: Inhibition of human MMP-9
In DepthDetails ArticlePubMed
Target72 kDa type IV collagenase(Homo sapiens (Human))
Pfizer
Curated by ChEMBL
LigandPNGBDBM50343078(CHEMBL1771213 | N-hydroxy-4-(4-(4-(4-methoxybenzoy...)
Affinity DataIC50:  1.30E+3nM. Assay description: Inhibition of human MMP-2
In DepthDetails ArticlePubMed