BDBM50343171 2-(1-(2-fluorobenzyl)-1H-indol-3-ylsulfonyl)-N-(5-methylisoxazol-3-yl)acetamide::CHEMBL1773096
SMILES Cc1cc(NC(=O)CS(=O)(=O)c2cn(Cc3ccccc3F)c3ccccc23)no1
InChI Key InChIKey=AYEMFUUAKXKLKN-UHFFFAOYSA-N
Data  1 EC50
  Tab Delimited (TSV)   2D SDfile   Computed 3D by Vconf -m prep SDfile
Find this compound or compounds like it in BindingDB:
Activity Spreadsheet -- Enzyme Inhibition Constant Data from BindingDB
Found 1 hit for monomerid = 50343171
TargetMuscarinic acetylcholine receptor M1(RAT)
Vanderbilt Institute Of Chemical Biology/Chemical Synthesis Core
Curated by ChEMBL
LigandPNGBDBM50343171(2-(1-(2-fluorobenzyl)-1H-indol-3-ylsulfonyl)-N-(5-...)
Affinity DataEC50: >1.00E+4nM. Assay description: Allosteric modulation at rat M1 receptor expressed in CHO cells by calcium mobilization assay
In DepthDetails ArticlePubMed