BDBM50343402 CHEMBL1599158::N-(4-(dimethylamino)phenyl)-2-(4-(furan-2-yl)-6-(trifluoromethyl)pyrimidin-2-ylthio)acetamide
SMILES CN(C)c1ccc(NC(=O)CSc2nc(cc(n2)C(F)(F)F)-c2ccco2)cc1
InChI Key InChIKey=KCKJRQJJSBPZAL-UHFFFAOYSA-N
Data  1 IC50
  Tab Delimited (TSV)   2D SDfile   Computed 3D by Vconf -m prep SDfile
Find this compound or compounds like it in BindingDB:
Activity Spreadsheet -- Enzyme Inhibition Constant Data from BindingDB
Found 1 hit for monomerid = 50343402
TargetUracil-DNA glycosylase(Vaccinia virus (strain Western Reserve) (VACV) (Va...)
University Of Pennsylvania
Curated by ChEMBL
LigandPNGBDBM50343402(CHEMBL1599158 | N-(4-(dimethylamino)phenyl)-2-(4-(...)
Affinity DataIC50:  1.40E+5nM. Assay description: Inhibition of Vaccinia virus WR strain processivity factor D4 interaction with A20 protein assessed as inhibition of E9 DNA polymerase-mediated DIG-d...
In DepthDetails ArticlePubMed