BDBM50343419 CHEMBL1775043::N-Benzyl-1-(2-chloro-2-phenylethyl)-6-(methylsulfonyl)-1H-pyrazolo[3,4-d]pyrimidin-4-amine
SMILES CS(=O)(=O)c1nc(NCc2ccccc2)c2cnn(CC(Cl)c3ccccc3)c2n1
InChI Key InChIKey=SBOWFSJAIITCRO-UHFFFAOYSA-N
Data  2 KI
  Tab Delimited (TSV)   2D SDfile   Computed 3D by Vconf -m prep SDfile
Find this compound or compounds like it in BindingDB:
Activity Spreadsheet -- Enzyme Inhibition Constant Data from BindingDB
Found 2 hits for monomerid = 50343419
TargetProto-oncogene tyrosine-protein kinase Src(Homo sapiens (Human))
University Of Siena
Curated by ChEMBL
LigandPNGBDBM50343419(CHEMBL1775043 | N-Benzyl-1-(2-chloro-2-phenylethyl...)
Affinity DataKi:  740nM. Assay description: Inhibition of human recombinant c-Src by filter-binding assay
In DepthDetails ArticlePubMed
TargetTyrosine-protein kinase ABL1(Homo sapiens (Human))
University Of Siena
Curated by ChEMBL
LigandPNGBDBM50343419(CHEMBL1775043 | N-Benzyl-1-(2-chloro-2-phenylethyl...)
Affinity DataKi:  2.00E+3nM. Assay description: Inhibition of human recombinant c-Abl by filter-binding assay
In DepthDetails ArticlePubMed