BDBM50343557 (S)-8-(5-(2-(hydroxymethyl)-4-methylpiperazin-1-yl)-2-(trifluoromethoxy)phenylamino)-1-methyl-4,5-dihydro-1H-pyrazolo[4,3-h]quinazoline-3-carboxamide::CHEMBL1774335
SMILES CN1CCN([C@H](CO)C1)c1ccc(OC(F)(F)F)c(Nc2ncc3CCc4c(nn(C)c4-c3n2)C(N)=O)c1
InChI Key InChIKey=VCZOROQVTTWAJY-HNNXBMFYSA-N
Data  3 IC50
  Tab Delimited (TSV)   2D SDfile   Computed 3D by Vconf -m prep SDfile
Find this compound or compounds like it in BindingDB:
Activity Spreadsheet -- Enzyme Inhibition Constant Data from BindingDB
Found 3 hits for monomerid = 50343557
TargetSerine/threonine-protein kinase PLK3(Homo sapiens (Human))
Nerviano Medical Sciences
Curated by ChEMBL
LigandPNGBDBM50343557((S)-8-(5-(2-(hydroxymethyl)-4-methylpiperazin-1-yl...)
Affinity DataIC50:  3.52E+3nM. Assay description: Inhibition of PLK3 assessed as [33P]gamma-ATP incorporation into substrate after 60 mins by gamma counting
In DepthDetails ArticlePubMed
TargetSerine/threonine-protein kinase PLK1(Homo sapiens (Human))
Nerviano Medical Sciences
Curated by ChEMBL
LigandPNGBDBM50343557((S)-8-(5-(2-(hydroxymethyl)-4-methylpiperazin-1-yl...)
Affinity DataIC50:  201nM. Assay description: Inhibition of PLK1 assessed as [33P]gamma-ATP incorporation into substrate after 60 mins by gamma counting
In DepthDetails ArticlePubMed
TargetSerine/threonine-protein kinase PLK2(Homo sapiens (Human))
Nerviano Medical Sciences
Curated by ChEMBL
LigandPNGBDBM50343557((S)-8-(5-(2-(hydroxymethyl)-4-methylpiperazin-1-yl...)
Affinity DataIC50:  1.49E+3nM. Assay description: Inhibition of PLK2 assessed as [33P]gamma-ATP incorporation into substrate after 60 mins by gamma counting
In DepthDetails ArticlePubMed