BDBM50343720 3-(4-(5-(4-methoxyphenyl)-4-p-tolylpyrimidine-2-carbonyl)piperazin-1-yl)-1-naphthoic acid::CHEMBL1774042
SMILES COc1ccc(cc1)-c1cnc(nc1-c1ccc(C)cc1)C(=O)N1CCN(CC1)c1cc(C(O)=O)c2ccccc2c1
InChI Key InChIKey=JSEMFKSLBFOVOB-UHFFFAOYSA-N
Data  1 IC50  1 EC50
  Tab Delimited (TSV)   2D SDfile   Computed 3D by Vconf -m prep SDfile
Find this compound or compounds like it in BindingDB:
Activity Spreadsheet -- Enzyme Inhibition Constant Data from BindingDB
Found 2 hits for monomerid = 50343720
TargetCholecystokinin receptor type A(Homo sapiens (Human))
Merck
Curated by ChEMBL
LigandPNGBDBM50343720(3-(4-(5-(4-methoxyphenyl)-4-p-tolylpyrimidine-2-ca...)
Affinity DataIC50:  2nM. Assay description: Displacement of [I125]-CCK8 from human CCK1 receptor expressed in CHO Flip cells after 2 hrs by scintillation counting
In DepthDetails ArticlePubMed
TargetCholecystokinin receptor type A(Homo sapiens (Human))
Merck
Curated by ChEMBL
LigandPNGBDBM50343720(3-(4-(5-(4-methoxyphenyl)-4-p-tolylpyrimidine-2-ca...)
Affinity DataEC50:  0.200nM. Assay description: Agonist activity at human CCK1 receptor expressed in CHO Flip cells assessed as increase of radio labeled inositol phosphate accumulation by Wallac m...
In DepthDetails ArticlePubMed