BDBM50343790 CHEMBL1774532::N-(3-Fluoro-4-(4-(2-methoxyphenyl)piperazin-1-yl)butyl)-5-methoxybenzofuran-2-carboxamide
SMILES COc1ccc2oc(cc2c1)C(=O)NCCC(F)CN1CCN(CC1)c1ccccc1OC
InChI Key InChIKey=CSQTYZHHBNDDMS-UHFFFAOYSA-N
Data  4 KI  2 IC50  1 EC50
  Tab Delimited (TSV)   2D SDfile   Computed 3D by Vconf -m prep SDfile
Find this compound or compounds like it in BindingDB:
Activity Spreadsheet -- Enzyme Inhibition Constant Data from BindingDB
Found 7 hits for monomerid = 50343790
TargetD(3) dopamine receptor(Homo sapiens (Human))
National Institute On Drug Abuse-Intramural Research Program
Curated by ChEMBL
LigandPNGBDBM50343790(CHEMBL1774532 | N-(3-Fluoro-4-(4-(2-methoxyphenyl)...)
Affinity DataKi:  13.9nM. Assay description: Displacement of [125I]-IABN from human dopamine D3 receptor expressed in HEK293 cells after 60 mins by gamma counting
In DepthDetails ArticlePubMed
Target5-hydroxytryptamine receptor 1A(Homo sapiens (Human))
National Institute On Drug Abuse-Intramural Research Program
Curated by ChEMBL
LigandPNGBDBM50343790(CHEMBL1774532 | N-(3-Fluoro-4-(4-(2-methoxyphenyl)...)
Affinity DataKi:  73nM. Assay description: Displacement of [3H]8-OH-DPAT from 5HT1A receptor
In DepthDetails ArticlePubMed
TargetD(2) dopamine receptor(Homo sapiens (Human))
National Institute On Drug Abuse-Intramural Research Program
Curated by ChEMBL
LigandPNGBDBM50343790(CHEMBL1774532 | N-(3-Fluoro-4-(4-(2-methoxyphenyl)...)
Affinity DataKi:  274nM. Assay description: Displacement of [125I]-IABN from human dopamine D2L receptor expressed in HEK293 cells after 60 mins by gamma counting
In DepthDetails ArticlePubMed
Target5-hydroxytryptamine receptor 2A(Homo sapiens (Human))
National Institute On Drug Abuse-Intramural Research Program
Curated by ChEMBL
LigandPNGBDBM50343790(CHEMBL1774532 | N-(3-Fluoro-4-(4-(2-methoxyphenyl)...)
Affinity DataKi:  3.00E+3nM. Assay description: Displacement of [125I]DOI from 5HT2A receptor
In DepthDetails ArticlePubMed
Target5-hydroxytryptamine receptor 1A(Homo sapiens (Human))
National Institute On Drug Abuse-Intramural Research Program
Curated by ChEMBL
LigandPNGBDBM50343790(CHEMBL1774532 | N-(3-Fluoro-4-(4-(2-methoxyphenyl)...)
Affinity DataEC50:  600nM. Assay description: Agonist activity at 5HT1A receptor assessed as stimulation of [35S]GTPgammaS binding
In DepthDetails ArticlePubMed
TargetD(3) dopamine receptor(Homo sapiens (Human))
National Institute On Drug Abuse-Intramural Research Program
Curated by ChEMBL
LigandPNGBDBM50343790(CHEMBL1774532 | N-(3-Fluoro-4-(4-(2-methoxyphenyl)...)
Affinity DataIC50:  780nM. Assay description: Antagonist activity at human dopamine D3 receptor expressed in CHOp cells assessed as inhibition of quinopirole-induced mitogenisis
In DepthDetails ArticlePubMed
TargetD(3) dopamine receptor(Homo sapiens (Human))
National Institute On Drug Abuse-Intramural Research Program
Curated by ChEMBL
LigandPNGBDBM50343790(CHEMBL1774532 | N-(3-Fluoro-4-(4-(2-methoxyphenyl)...)
Affinity DataIC50:  1.24E+3nM. Assay description: Antagonist activity at human dopamine D3 receptor expressed in CHO-K1 cells assessed as inhibition of dopamine-induced recruitment of beta-arrestin-2...
In DepthDetails ArticlePubMed