BDBM50344127 6-(2,4-difluorophenoxy)-N-(2-(methylsulfonyl)ethyl)-1H-pyrazolo[3,4-d]pyrimidin-3-amine::CHEMBL1778186
SMILES CS(=O)(=O)CCNc1[nH]nc2nc(Oc3ccc(F)cc3F)ncc12
InChI Key InChIKey=GGGSWPHAACVPQT-UHFFFAOYSA-N
Data  1 IC50
  Tab Delimited (TSV)   2D SDfile   Computed 3D by Vconf -m prep SDfile
Find this compound or compounds like it in BindingDB:
Activity Spreadsheet -- Enzyme Inhibition Constant Data from BindingDB
Found 1 hit for monomerid = 50344127
TargetMitogen-activated protein kinase 14(Homo sapiens (Human))
Roche Palo Alto
Curated by ChEMBL
LigandPNGBDBM50344127(6-(2,4-difluorophenoxy)-N-(2-(methylsulfonyl)ethyl...)
Affinity DataIC50:  1.04E+4nM. Assay description: Inhibition of p38alpha assessed as [33P]gamma-ATP incorporation into myelin basic protein
In DepthDetails ArticlePubMed